BDBM50001593 CHEMBL131872::N-{1-[1-(1-{1-[1-(1-Carbamoyl-3-methylsulfanyl-propylcarbamoyl)-3-methyl-butyl]-2-oxo-pyrrolidin-3-ylcarbamoyl}-2-methyl-propylcarbamoyl)-2-phenyl-ethylcarbamoyl]-2-hydroxy-ethyl}-3-(2,6-diamino-hexanoylamino)-succinamic acid
SMILES CSCC[C@H](NC(=O)[C@H](CC(C)C)N1CCC(NC(=O)[C@@H](NC(=O)[C@H](Cc2ccccc2)NC(=O)[C@H](CO)NC(=O)[C@H](CC(O)=O)NC(=O)[C@@H](N)CCCCN)C(C)C)C1=O)C(N)=O
InChI Key InChIKey=HVUNRXRFMQDMBO-BPZYSUIOSA-N
Data  3 EC50
  Tab Delimited (TSV)   2D SDfile   Computed 3D by Vconf -m prep SDfile
Find this compound or compounds like it in BindingDB:
Activity Spreadsheet -- Enzyme Inhibition Constant Data from BindingDB
Found 1 hit for monomerid = 50001593
TargetSubstance-P receptor(GUINEA PIG)
Glaxo Group Research
Curated by ChEMBL
LigandPNGBDBM50001593(CHEMBL131872 | N-{1-[1-(1-{1-[1-(1-Carbamoyl-3-met...)
Affinity DataEC50:  4.24E+3nM. Assay description: In vitro agonistic activity against tachykinin receptor 1 of guinea pig ileum longitudinal smooth muscle.
In DepthDetails ArticlePubMed